No,����,�t���K�i,����,���N����,�g�ѓd�b,�d�q���[��,�X�֔ԍ�,�Z���P,�Z���Q,�Z���R,�d�b�ԍ�,�d�b�ԍ�2,����,���l,�Ƒ��P,�Ƒ��P�J�i,�Ƒ��P����,�Ƒ��P���N,�Ƒ��P�g��,�Ƒ��P���[��,�Ƒ�2,�Ƒ�2�J�i,�Ƒ��Q����,�Ƒ��Q���N,�Љ��1,�Љ�҂Q,�O���[�v1,�O���[�v�Q
1,���R�@���Y,���� �۳,�j,1963/1/6,010-2222-9876,info@imoment.net,659-0065,���Ɍ������s������7-15,,�A�C���[�����g�r��,0797-32-1000,,1,�C���|�[�g�T���v���ł�,�Ԏq,�ź,��,1972/1/1,060-555-4321,,���Y,��۳,,,,�ԍ� ��Y,�{��,�Q��
2,�~�R ���Y,���� շ�,�j,1940/2/9,090-8904-40500,,659-0055,���Ɍ������s�|����310-A-102,,,0797-16-4646,,1,,���},�^�~�G,��,1944/9/5,,,�a�q,��޺,,1951/1/3,�쑺���q�q-��t��,,�Q��,
3,���i �L,̸Ŷ� ���,�j,1942/12/3,,154@uiui.ijiu.com,771-1621,���������g�s���J�g�q131,,,0210-16-5055,,2,,,,,,,,,,,,�ێR�E,,1��,����
4,���� �M�j,̸�� �Ƶ,�j,,,,771-1501,���������g�s�y�����H��163,,,0210-16-2614,,1,,�Õ�,�V�Y�z,��,1935/12/31,030-8404-9880,,�_��,�R�E�C�`,�j,,�쑺���q�q-��t��,,1��,�{��
5,�~�R �ǕF,���� ּ˺,�j,1951/1/3,060-5404-0121,,771-1621,���g�s�s�꒬���J137,,,,,1,�o�w���Ɍ��エ�肢����B,,,,,,,,,,,�R�����a�q-����,���L �a�v,�Q��,
6,��� �[��,��޷ ����,�j,1949/7/5,,,771-1612,���g�s�s�꒬��었140,,,0250-56-5551,,1,,�^�L��,���,��,1971/3/25,,,,,,,�쑺���q�q-��t��,,�Q��,
7,���� �^�s,�ɵ �ݲ�,�j,,,,771-1612,���������g�s�s�꒬��었281,,,,,3,,,,,,,,,,,,�쑺���q�q-��t��,,1��,
8,��� �d��,��޷ ������,�j,1970/4/27,010-1540-4041,,769-2304,���쌧���ʂ��s���a341,,,0489-1156-2201,,2,,,,,,,,,,,,���J�쏺�Y-��,,1��,
9,��� �͏H,��޷ �ر�,�j,1948/3/28,,noriaki@imoment.net,769-2304,���쌧���ʂ��s���a87-3,,,0489-1156-5225,,1,,�b�q,������,��,1962/1/25,,keiko@imoment.net,,,,,�����K��,�n�Ӌ`��-����,1��,�{��
10,���o ��,˶޼�� �ۼ,�j,1948/12/11,,,771-1612,���g�s�s�꒬��었333,,,0250-56-5150,,0,,,,,,,,,,,,�͂܂Ȃ��̉�,,1��,
11,��� ����,˸�� ���,�j,1926/12/2,,,771-1612,���������g�s�s�꒬��었149-1,,,0210-16-1419,0270-36-3727,4,,,,,,,,,,,,,,1��,
12,�v�{ ���M,˻�� �����,�j,,,,771-1602,���������g�s���i183-6,,,0250-36-2162,,1,,�ǔ�,���V�~,��,1962/10/12,,,,,,,�쑺���q�q-��t��,,1��,
13,�{�Q ���V,��� ��շ,�j,1926/7/28,020-5410-4981,,769-2304,���쌧���ʂ��s���a210-3-���c�Z��102��,,,,,1,,,,,,010-4008-5012,,,,,,�{�R���t-�D�y,,1��,
14,���c �t,��� ս��,�j,1978/3/27,,,769-2102,���ʂ��s����2-12-2,,,0210-16-1244,,2,,,,,,,,,,,,���ؕی����޽,,1��,����
15,���� �d�K,ʯ�� ���շ,�j,,,,980-0811,���s�t���Ԓ�173-30-102,,��ԃ��C�I���Y�}���V����,0210-16-4622,,0,,��,����,�j,1931/4/1,,,,,,,���r ��-�b��{,,1��,����
16,�n�� ��,���� ���,�j,1983/8/26,,,769-2102,���ʂ��s����120-10-25,,,0488-16-4212,0487-46-2391,,,�����G,��肦,��,,,,���,����,��,1950/8/18,�R�c����-�͂܂Ȃ�,,1��,
17,�l�� �h��,�ϸ�� ����,�j,1951/1/27,,,980-0811,���s�t���Ԓ���쓇84-9-703,,,0250-56-5665,,2,,,,,,,,,,,,�쑺���q�q-��t��,���ؕی����޽,1��,
18,�{�� ����,�� ϻ�,�j,,,,659-0064,�����s������41-1,,,0797-16-4111,,1,,���q,,,1965/12/22,,,,,,,,,1��,�{��
19,�{�� �R�Y,�� ּ�,�j,1952/1/22,,,769-2102,���ʂ��s����23-8,,,0481-56-5509,0488-26-4657,3,,,,,,,,,,,,,,3��,�{��
20,�{�� �F��,�� ּ��,�j,1959/9/3,,,771-1627,���������g�s�]�m��68-3-302,,,0210-16-4640,,50,,�e���q,,,1935/1/20,,,,,,,,,3��,�{��
21,���U ���s,�п޳ ļշ,�j,1953/1/5,,,980-0804,�{�錧���s�t��咬208-1,,,0250-56-2444,,10,,���q,���X�R,��,1930/12/21,,,����,����,�j,1956/11/25,������-�≀,,3��,
22,�Z�F �M�u,���� ���,�j,1944/9/15,,,980-0804,���s�t��咬14-18-301,,,0210-16-6504,,,,,,,,,,,,,,�n�Ӌ`��-����,,3��,
23,���� ���M,�� �����,�j,1967/12/21,,,980-0804,�{�錧���s�t��咬63-12,,,0210-76-4897,,11,,����,���,��,1960/6/7,,,,,,,,,3��,
24,���� ���j,�� �ٵ,�j,1952/10/17,,,659-0064,���Ɍ������s������123,,,090-5555-0000,,12,,,,,,,,,,,,���m��i,,3��,
25,�Z�F ���K,���� ļշ,�j,1959/10/20,,,980-0811,���s�t���Ԓ�2-13-201,,,0250-56-4505,,,,,,,,,,,,,,�R�c����-�͂܂Ȃ�,,3��,���
26,�Z�F �L�s,���� ���շ,�j,,,,769-2304,���쌧���ʂ��s���a124-9,,,0210-16-4422,,2,,,,,,,,,,,,�͂܂Ȃ��̉�,,1��,
